Reaction Details
TargetPhosphatidylinositol 4,5-bisphosphate 3-kinase catalytic subunit gamma isoform
LigandBDBM50112822
Substrate/Competitorn/a
Meas. Tech.ChEMBL_1511998 (CHEMBL3610611)
IC50 5.0±n/a nM
Citation Fairhurst, RAGerspacher, MImbach-Weese, PMah, RCaravatti, GFuret, PFritsch, CSchnell, CBlanz, JBlasco, FDesrayaud, SGuthy, DAKnapp, MArz, DWirth, JRoehn-Carnemolla, ELuu, VH Identification and optimisation of 4,5-dihydrobenzo[1,2-d:3,4-d]bisthiazole and 4,5-dihydrothiazolo[4,5-h]quinazoline series of selective phosphatidylinositol-3 kinase alpha inhibitors. Bioorg Med Chem Lett25:3575-81 (2015) 
 
Phosphatidylinositol 4,5-bisphosphate 3-kinase catalytic subunit gamma isoform
Name:Phosphatidylinositol 4,5-bisphosphate 3-kinase catalytic subunit gamma isoform
Type:Enzyme Subunit
Mol. Mass.:126470.30
Organism:Homo sapiens (Human)
Description:P48736
Residue:1102
BDBM50112822
NameBDBM50112822
Synonyms:CHEMBL3609525
TypeSmall organic molecule
Emp. Form.C20H26N6O2S
Mol. Mass.414.524
SMILESC[C@@H]1CCN([C@@H]1C(N)=O)C(=O)Nc1nc2CCc3cnc(nc3-c2s1)C(C)(C)C