Reaction Details
TargetPhosphatidylinositol 4,5-bisphosphate 3-kinase catalytic subunit alpha isoform
LigandBDBM50112829
Substrate/Competitorn/a
Meas. Tech.ChEMBL_1511996 (CHEMBL3610609)
IC50 8.0±n/a nM
Citation Fairhurst, RAGerspacher, MImbach-Weese, PMah, RCaravatti, GFuret, PFritsch, CSchnell, CBlanz, JBlasco, FDesrayaud, SGuthy, DAKnapp, MArz, DWirth, JRoehn-Carnemolla, ELuu, VH Identification and optimisation of 4,5-dihydrobenzo[1,2-d:3,4-d]bisthiazole and 4,5-dihydrothiazolo[4,5-h]quinazoline series of selective phosphatidylinositol-3 kinase alpha inhibitors. Bioorg Med Chem Lett25:3575-81 (2015) 
 
Phosphatidylinositol 4,5-bisphosphate 3-kinase catalytic subunit alpha isoform
Name:Phosphatidylinositol 4,5-bisphosphate 3-kinase catalytic subunit alpha isoform
Type:Enzyme Subunit
Mol. Mass.:124294.87
Organism:Homo sapiens (Human)
Description:P42336
Residue:1068
BDBM50112829
NameBDBM50112829
Synonyms:CHEMBL3609516
TypeSmall organic molecule
Emp. Form.C19H25N5O2S2
Mol. Mass.419.564
SMILESCC(C)(C)c1nc-2c(CCc3nc(NC(=O)N4CCC[C@@]4(C)C(N)=O)sc-23)s1