Reaction Details
TargetPhosphatidylinositol 4,5-bisphosphate 3-kinase catalytic subunit alpha isoform
LigandBDBM50112830
Substrate/Competitorn/a
Meas. Tech.ChEMBL_1511996 (CHEMBL3610609)
IC50 9.0±n/a nM
Citation Fairhurst, RAGerspacher, MImbach-Weese, PMah, RCaravatti, GFuret, PFritsch, CSchnell, CBlanz, JBlasco, FDesrayaud, SGuthy, DAKnapp, MArz, DWirth, JRoehn-Carnemolla, ELuu, VH Identification and optimisation of 4,5-dihydrobenzo[1,2-d:3,4-d]bisthiazole and 4,5-dihydrothiazolo[4,5-h]quinazoline series of selective phosphatidylinositol-3 kinase alpha inhibitors. Bioorg Med Chem Lett25:3575-81 (2015) 
 
Phosphatidylinositol 4,5-bisphosphate 3-kinase catalytic subunit alpha isoform
Name:Phosphatidylinositol 4,5-bisphosphate 3-kinase catalytic subunit alpha isoform
Type:Enzyme Subunit
Mol. Mass.:124294.87
Organism:Homo sapiens (Human)
Description:P42336
Residue:1068
BDBM50112830
NameBDBM50112830
Synonyms:CHEMBL3609517
TypeSmall organic molecule
Emp. Form.C19H23N5O2S2
Mol. Mass.417.548
SMILES[H][C@@]12C[C@@]1(N(CC2)C(=O)Nc1nc2CCc3sc(nc3-c2s1)C(C)(C)C)C(N)=O