Reaction Details
TargetPancreatic triacylglycerol lipase
LigandBDBM50193719
Substrate/Competitorn/a
Meas. Tech.ChEMBL_1512589 (CHEMBL3610636)
IC50 6500±n/a nM
Citation Jo, YHKim, SBLiu, QLee, JWHwang, BYLee, MK Benzylated and prenylated flavonoids from the root barks of Cudrania tricuspidata with pancreatic lipase inhibitory activity. Bioorg Med Chem Lett25:3455-7 (2015) 
 
Pancreatic triacylglycerol lipase
Name:Pancreatic triacylglycerol lipase
Type:Enzyme
Mol. Mass.:50080.69
Organism:Sus scrofa (Pig)
Description:P00591
Residue:450
BDBM50193719
NameBDBM50193719
Synonyms:(S)-5,7,7'-trihydroxy-2',2'-dimethyl-6-(3-methylbut-2-enyl)-2,6'-bichroman-4-one CHEMBL220746 | cudraflavanone A
TypeSmall organic molecule
Emp. Form.C25H26O6
Mol. Mass.422.4703
SMILES[#6]\[#6](-[#6])=[#6]\[#6]-c1c(-[#8])cc2-[#8]-[#6@@H](-[#6]-[#6](=O)-c2c1-[#8])-c1cc2-[#6]=[#6]C([#6])([#6])[#8]-c2cc1-[#8]