Reaction Details
TargetSerine/threonine-protein kinase TNNI3K
LigandBDBM50118467
Substrate/Competitorn/a
Meas. Tech.ChEMBL_1514933 (CHEMBL3615799)
IC50 13±n/a nM
Citation Lawhorn, BGPhilp, JZhao, YLouer, CHammond, MCheung, MFries, HGraves, APShewchuk, LWang, LCottom, JEQi, HZhao, HTotoritis, RZhang, GSchwartz, BLi, HSweitzer, SHolt, DAGatto, GJKallander, LS Identification of Purines and 7-Deazapurines as Potent and Selective Type I Inhibitors of Troponin I-Interacting Kinase (TNNI3K). J Med Chem58:7431-48 (2015) 
 
Serine/threonine-protein kinase TNNI3K
Name:Serine/threonine-protein kinase TNNI3K
Type:Enzyme Catalytic Domain
Mol. Mass.:92855.14
Organism:Homo sapiens (Human)
Description:gi_7705748
Residue:835
BDBM50118467
NameBDBM50118467
Synonyms:CHEMBL3613189
TypeSmall organic molecule
Emp. Form.C19H17N5O3S
Mol. Mass.395.435
SMILESCNS(=O)(=O)c1cccc(Nc2ncnc3[nH]c(cc23)-c2ccc(O)cc2)c1