Reaction Details
TargetSerine/threonine-protein kinase B-raf
LigandBDBM50118422
Substrate/Competitorn/a
Meas. Tech.ChEMBL_1514934 (CHEMBL3615800)
IC50 4.0±n/a nM
Citation Lawhorn, BGPhilp, JZhao, YLouer, CHammond, MCheung, MFries, HGraves, APShewchuk, LWang, LCottom, JEQi, HZhao, HTotoritis, RZhang, GSchwartz, BLi, HSweitzer, SHolt, DAGatto, GJKallander, LS Identification of Purines and 7-Deazapurines as Potent and Selective Type I Inhibitors of Troponin I-Interacting Kinase (TNNI3K). J Med Chem58:7431-48 (2015) 
 
Serine/threonine-protein kinase B-raf
Name:Serine/threonine-protein kinase B-raf
Type:Serine/threonine-protein kinase
Mol. Mass.:84446.00
Organism:Homo sapiens (Human)
Description:P15056
Residue:766
BDBM50118422
NameBDBM50118422
Synonyms:CHEMBL3613179
TypeSmall organic molecule
Emp. Form.C20H19N5O3S
Mol. Mass.409.462
SMILESCNS(=O)(=O)c1cccc(Nc2ncnc3[nH]cc(-c4ccc(OC)cc4)c23)c1