Reaction Details
TargetSerine/threonine-protein kinase B-raf
LigandBDBM50118467
Substrate/Competitorn/a
Meas. Tech.ChEMBL_1514934 (CHEMBL3615800)
IC50 1.000000±n/a nM
Citation Lawhorn, BGPhilp, JZhao, YLouer, CHammond, MCheung, MFries, HGraves, APShewchuk, LWang, LCottom, JEQi, HZhao, HTotoritis, RZhang, GSchwartz, BLi, HSweitzer, SHolt, DAGatto, GJKallander, LS Identification of Purines and 7-Deazapurines as Potent and Selective Type I Inhibitors of Troponin I-Interacting Kinase (TNNI3K). J Med Chem58:7431-48 (2015) 
 
Serine/threonine-protein kinase B-raf
Name:Serine/threonine-protein kinase B-raf
Type:Serine/threonine-protein kinase
Mol. Mass.:84446.00
Organism:Homo sapiens (Human)
Description:P15056
Residue:766
BDBM50118467
NameBDBM50118467
Synonyms:CHEMBL3613189
TypeSmall organic molecule
Emp. Form.C19H17N5O3S
Mol. Mass.395.435
SMILESCNS(=O)(=O)c1cccc(Nc2ncnc3[nH]c(cc23)-c2ccc(O)cc2)c1