Reaction Details
TargetSerine/threonine-protein kinase B-raf
LigandBDBM50118382
Substrate/Competitorn/a
Meas. Tech.ChEMBL_1514934 (CHEMBL3615800)
IC50 0.200000±n/a nM
Citation Lawhorn, BGPhilp, JZhao, YLouer, CHammond, MCheung, MFries, HGraves, APShewchuk, LWang, LCottom, JEQi, HZhao, HTotoritis, RZhang, GSchwartz, BLi, HSweitzer, SHolt, DAGatto, GJKallander, LS Identification of Purines and 7-Deazapurines as Potent and Selective Type I Inhibitors of Troponin I-Interacting Kinase (TNNI3K). J Med Chem58:7431-48 (2015) 
 
Serine/threonine-protein kinase B-raf
Name:Serine/threonine-protein kinase B-raf
Type:Serine/threonine-protein kinase
Mol. Mass.:84446.00
Organism:Homo sapiens (Human)
Description:P15056
Residue:766
BDBM50118382
NameBDBM50118382
Synonyms:CHEMBL3613198
TypeSmall organic molecule
Emp. Form.C15H17BrN6O2S
Mol. Mass.425.303
SMILESCNS(=O)(=O)c1ccc(N(C)C)c(Nc2ncnc3[nH]cc(Br)c23)c1