Reaction Details
TargetMelanin-concentrating hormone receptor 1
LigandBDBM50120635
Substrate/Competitorn/a
Meas. Tech.ChEMBL_1518193 (CHEMBL3619840)
Ki 0.500000±n/a nM
Citation Devasthale, PWang, WMignone, JRenduchintala, KRadhakrishnan, SDhanapal, JSelvaraj, JKuppusamy, RPelleymounter, MALonghi, DHuang, NFlynn, NAzzara, AVRohrbach, KDevenny, JRooney, SThomas, MGlick, SGodonis, HHarvey, SCullen, MJZhang, HCaporuscio, CStetsko, PGrubb, MHuang, CZhang, LFreeden, CMurphy, BJRobl, JAWashburn, WN Non-basic azolotriazinone MCHR1 antagonists for the treatment of obesity: An empirical brain-exposures-driven candidate selection for in vivo efficacy studies. Bioorg Med Chem Lett25:4412-8 (2015) 
 
Melanin-concentrating hormone receptor 1
Name:Melanin-concentrating hormone receptor 1
Type:Enzyme Catalytic Domain
Mol. Mass.:39075.64
Organism:RAT
Description:Melanin Concentrating Hormone 1 GPR24 RAT::P97639
Residue:353
BDBM50120635
NameBDBM50120635
Synonyms:CHEMBL3618325
TypeSmall organic molecule
Emp. Form.C24H24ClN5O3
Mol. Mass.465.932
SMILESCOc1cc(ccc1OCCN1CCCC1)-n1cnn2nc(cc2c1=O)-c1ccc(Cl)cc1