Reaction Details
TargetMelanin-concentrating hormone receptor 1
LigandBDBM50120624
Substrate/Competitorn/a
Meas. Tech.ChEMBL_1518193 (CHEMBL3619840)
Ki 0.400000±n/a nM
Citation Devasthale, PWang, WMignone, JRenduchintala, KRadhakrishnan, SDhanapal, JSelvaraj, JKuppusamy, RPelleymounter, MALonghi, DHuang, NFlynn, NAzzara, AVRohrbach, KDevenny, JRooney, SThomas, MGlick, SGodonis, HHarvey, SCullen, MJZhang, HCaporuscio, CStetsko, PGrubb, MHuang, CZhang, LFreeden, CMurphy, BJRobl, JAWashburn, WN Non-basic azolotriazinone MCHR1 antagonists for the treatment of obesity: An empirical brain-exposures-driven candidate selection for in vivo efficacy studies. Bioorg Med Chem Lett25:4412-8 (2015) 
 
Melanin-concentrating hormone receptor 1
Name:Melanin-concentrating hormone receptor 1
Type:Enzyme Catalytic Domain
Mol. Mass.:39075.64
Organism:RAT
Description:Melanin Concentrating Hormone 1 GPR24 RAT::P97639
Residue:353
BDBM50120624
NameBDBM50120624
Synonyms:CHEMBL3618324
TypeSmall organic molecule
Emp. Form.C25H25ClN4O3
Mol. Mass.464.944
SMILESCOc1cc(ccc1OCCN1CCCC1)-n1cnn2cc(cc2c1=O)-c1ccc(Cl)cc1