Reaction Details
TargetHistone-lysine N-methyltransferase SETD7
LigandBDBM50124904
Substrate/Competitorn/a
Meas. Tech.ChEMBL_1521870 (CHEMBL3626816)
IC50 61550±n/a nM
Citation Meng, FCheng, SDing, HLiu, SLiu, YZhu, KChen, SLu, JXie, YLi, LLiu, RShi, ZZhou, YLiu, YCZheng, MJiang, HLu, WLiu, HLuo, C Discovery and Optimization of Novel, Selective Histone Methyltransferase SET7 Inhibitors by Pharmacophore- and Docking-Based Virtual Screening. J Med Chem58:8166-81 (2015) 
 
Histone-lysine N-methyltransferase SETD7
Name:Histone-lysine N-methyltransferase SETD7
Type:Enzyme
Mol. Mass.:40691.12
Organism:Homo sapiens (Human)
Description:Q8WTS6
Residue:366
BDBM50124904
NameBDBM50124904
Synonyms:CHEMBL3623769
TypeSmall organic molecule
Emp. Form.C16H15N3O3S
Mol. Mass.329.374
SMILESCCOC(=O)c1c(N)sc(C(=O)Nc2cccc(c2)C#N)c1C