Reaction Details
TargetHistone-lysine N-methyltransferase SETD7
LigandBDBM50124905
Substrate/Competitorn/a
Meas. Tech.ChEMBL_1521870 (CHEMBL3626816)
IC50 4880±n/a nM
Citation Meng, FCheng, SDing, HLiu, SLiu, YZhu, KChen, SLu, JXie, YLi, LLiu, RShi, ZZhou, YLiu, YCZheng, MJiang, HLu, WLiu, HLuo, C Discovery and Optimization of Novel, Selective Histone Methyltransferase SET7 Inhibitors by Pharmacophore- and Docking-Based Virtual Screening. J Med Chem58:8166-81 (2015) 
 
Histone-lysine N-methyltransferase SETD7
Name:Histone-lysine N-methyltransferase SETD7
Type:Enzyme
Mol. Mass.:40691.12
Organism:Homo sapiens (Human)
Description:Q8WTS6
Residue:366
BDBM50124905
NameBDBM50124905
Synonyms:CHEMBL3623770
TypeSmall organic molecule
Emp. Form.C14H13N3O5S
Mol. Mass.335.335
SMILESCOC(=O)c1c(N)sc(C(=O)Nc2cccc(c2)[N+]([O-])=O)c1C