Reaction Details
TargetCytochrome P450 11B2, mitochondrial
LigandBDBM50125049
Substrate/Competitorn/a
Meas. Tech.ChEMBL_1518962 (CHEMBL3626114)
IC50 9.0±n/a nM
Citation Martin, REAebi, JDHornsperger, BKrebs, HJKuhn, BKuglstatter, AAlker, AMMärki, HPMüller, SBurger, DOttaviani, GRiboulet, WVerry, PTan, XAmrein, KMayweg, AV Discovery of 4-Aryl-5,6,7,8-tetrahydroisoquinolines as Potent, Selective, and Orally Active Aldosterone Synthase (CYP11B2) Inhibitors: In Vivo Evaluation in Rodents and Cynomolgus Monkeys. J Med Chem58:8054-65 (2015) 
 
Cytochrome P450 11B2, mitochondrial
Name:Cytochrome P450 11B2, mitochondrial
Type:Protein
Mol. Mass.:57582.15
Organism:Homo sapiens (Human)
Description:P19099
Residue:503
BDBM50125049
NameBDBM50125049
Synonyms:CHEMBL3623830
TypeSmall organic molecule
Emp. Form.C19H19N3O
Mol. Mass.305.3737
SMILESCCC(=O)N[C@@H]1CCCc2c1cncc2-c1ccc(cc1)C#N