Reaction Details
TargetCytochrome P450 3A4
LigandBDBM50125049
Substrate/Competitorn/a
Meas. Tech.ChEMBL_1518970 (CHEMBL3626122)
IC50>50000±n/a nM
Citation Martin, REAebi, JDHornsperger, BKrebs, HJKuhn, BKuglstatter, AAlker, AMMärki, HPMüller, SBurger, DOttaviani, GRiboulet, WVerry, PTan, XAmrein, KMayweg, AV Discovery of 4-Aryl-5,6,7,8-tetrahydroisoquinolines as Potent, Selective, and Orally Active Aldosterone Synthase (CYP11B2) Inhibitors: In Vivo Evaluation in Rodents and Cynomolgus Monkeys. J Med Chem58:8054-65 (2015) 
 
Cytochrome P450 3A4
Name:Cytochrome P450 3A4
Type:Enzyme
Mol. Mass.:57349.57
Organism:Homo sapiens (Human)
Description:n/a
Residue:503
BDBM50125049
NameBDBM50125049
Synonyms:CHEMBL3623830
TypeSmall organic molecule
Emp. Form.C19H19N3O
Mol. Mass.305.3737
SMILESCCC(=O)N[C@@H]1CCCc2c1cncc2-c1ccc(cc1)C#N