Reaction Details
TargetVascular endothelial growth factor receptor 2
LigandBDBM50126847
Substrate/Competitorn/a
Meas. Tech.ChEMBL_1523976 (CHEMBL3630448)
IC50 2700±n/a nM
Citation Salerno, SMarini, AMFornaciari, GSimorini, FLa Motta, CTaliani, SSartini, SDa Settimo, FGarcía-Argáez, ANGia, OCosconati, SNovellino, ED'Ocon, PFioravanti, AOrlandi, PBocci, GDalla Via, L Investigation of new 2-aryl substituted Benzothiopyrano[4,3-d]pyrimidines as kinase inhibitors targeting vascular endothelial growth factor receptor 2. Eur J Med Chem103:29-43 (2015) 
 
Vascular endothelial growth factor receptor 2
Name:Vascular endothelial growth factor receptor 2
Type:Receptor Tyrosine Kinase
Mol. Mass.:151510.97
Organism:Homo sapiens (Human)
Description:P35968
Residue:1356
BDBM50126847
NameBDBM50126847
Synonyms:CHEMBL3628537
TypeSmall organic molecule
Emp. Form.C18H15N3OS
Mol. Mass.321.396
SMILESCOc1ccc(Nc2ncc3CSc4ccccc4-c3n2)cc1