Reaction Details
TargetEpidermal growth factor receptor
LigandBDBM50126848
Substrate/Competitorn/a
Meas. Tech.ChEMBL_1523969 (CHEMBL3630441)
IC50 21180±n/a nM
Citation Salerno, SMarini, AMFornaciari, GSimorini, FLa Motta, CTaliani, SSartini, SDa Settimo, FGarcía-Argáez, ANGia, OCosconati, SNovellino, ED'Ocon, PFioravanti, AOrlandi, PBocci, GDalla Via, L Investigation of new 2-aryl substituted Benzothiopyrano[4,3-d]pyrimidines as kinase inhibitors targeting vascular endothelial growth factor receptor 2. Eur J Med Chem103:29-43 (2015) 
 
Epidermal growth factor receptor
Name:Epidermal growth factor receptor
Type:Receptor Kinase Domain
Mol. Mass.:134279.59
Organism:Homo sapiens (Human)
Description:P00533
Residue:1210
BDBM50126848
NameBDBM50126848
Synonyms:CHEMBL3628816
TypeSmall organic molecule
Emp. Form.C17H12ClN3S
Mol. Mass.325.815
SMILESClc1ccc-2c(SCc3cnc(Nc4ccccc4)nc-23)c1