Reaction Details
TargetFocal adhesion kinase 1
LigandBDBM2579
Substrate/Competitorn/a
Meas. Tech.ChEMBL_1523998 (CHEMBL3630470)
IC50 55.0±n/a nM
Citation Salerno, SMarini, AMFornaciari, GSimorini, FLa Motta, CTaliani, SSartini, SDa Settimo, FGarcía-Argáez, ANGia, OCosconati, SNovellino, ED'Ocon, PFioravanti, AOrlandi, PBocci, GDalla Via, L Investigation of new 2-aryl substituted Benzothiopyrano[4,3-d]pyrimidines as kinase inhibitors targeting vascular endothelial growth factor receptor 2. Eur J Med Chem103:29-43 (2015) 
 
Focal adhesion kinase 1
Name:Focal adhesion kinase 1
Type:Tyrosine-protein kinase
Mol. Mass.:119233.17
Organism:Homo sapiens (Human)
Description:Q05397
Residue:1052
BDBM2579
NameBDBM2579
Synonyms:(2S,3R,4R,6R)-3-methoxy-2-methyl-4-(methylamino)-29-oxa-1,7,17-triazaoctacyclo[12.12.2.1^{2,6}.0^{7,28}.0^{8,13}.0^{15,19}.0^{20,27}.0^{21,26}]nonacosa-8(13),9,11,14(28),15(19),20(27),21(26),22,24-nonaen-16-one Staurosporin, 4 Staurosporine, 8 US9206188, Staurosporine | US9226923, Staurosporine
TypeSmall organic molecule
Emp. Form.C28H26N4O3
Mol. Mass.466.531
SMILESCN[C@@H]1C[C@H]2O[C@@](C)([C@@H]1OC)n1c3ccccc3c3c4CNC(=O)c4c4c5ccccc5n2c4c13