Reaction Details
TargetTryptophan 2,3-dioxygenase
LigandBDBM50127205
Substrate/Competitorn/a
Meas. Tech.ChEMBL_1524691 (CHEMBL3631085)
IC50 209±n/a nM
Citation Wu, JSLin, SYLiao, FYHsiao, WCLee, LCPeng, YHHsieh, CLWu, MHSong, JSYueh, AChen, CHYeh, SHLiu, CYLin, SYYeh, TKHsu, JTShih, CUeng, SHHung, MSWu, SY Identification of Substituted Naphthotriazolediones as Novel Tryptophan 2,3-Dioxygenase (TDO) Inhibitors through Structure-Based Virtual Screening. J Med Chem58:7807-19 (2015) 
 
Tryptophan 2,3-dioxygenase
Name:Tryptophan 2,3-dioxygenase
Type:PROTEIN
Mol. Mass.:47874.48
Organism:Homo sapiens (Human)
Description:ChEMBL_825691
Residue:406
BDBM50127205
NameBDBM50127205
Synonyms:CHEMBL3628603
TypeSmall organic molecule
Emp. Form.C24H22N4O4
Mol. Mass.430.4559
SMILESCOC1CCN(CC1)C(=O)c1ccc(Cn2nnc3c2C(=O)c2ccccc2C3=O)cc1