Reaction Details
TargetIndoleamine 2,3-dioxygenase 1
LigandBDBM70489
Substrate/Competitorn/a
Meas. Tech.ChEMBL_1524692 (CHEMBL3631086)
IC50 4612±n/a nM
Citation Wu, JSLin, SYLiao, FYHsiao, WCLee, LCPeng, YHHsieh, CLWu, MHSong, JSYueh, AChen, CHYeh, SHLiu, CYLin, SYYeh, TKHsu, JTShih, CUeng, SHHung, MSWu, SY Identification of Substituted Naphthotriazolediones as Novel Tryptophan 2,3-Dioxygenase (TDO) Inhibitors through Structure-Based Virtual Screening. J Med Chem58:7807-19 (2015) 
 
Indoleamine 2,3-dioxygenase 1
Name:Indoleamine 2,3-dioxygenase 1
Type:Enzyme
Mol. Mass.:45330.80
Organism:Homo sapiens (Human)
Description:P14902
Residue:403
BDBM70489
NameBDBM70489
Synonyms:1-(3-methylbenzyl)-1H-naphtho[2,3-d][1,2,3]triazole-4,9-dione 3-[(3-methylphenyl)methyl]benzo[f]benzotriazole-4,9-dione SMR000115594 | cid_849734
TypeSmall organic molecule
Emp. Form.C18H13N3O2
Mol. Mass.303.3147
SMILESCc1cccc(Cn2nnc3c2C(=O)c2ccccc2C3=O)c1