Reaction Details
TargetReceptor-type tyrosine-protein kinase FLT3
LigandBDBM50127174
Substrate/Competitorn/a
Meas. Tech.ChEMBL_1524700 (CHEMBL3631094)
IC50>10000±n/a nM
Citation Wu, JSLin, SYLiao, FYHsiao, WCLee, LCPeng, YHHsieh, CLWu, MHSong, JSYueh, AChen, CHYeh, SHLiu, CYLin, SYYeh, TKHsu, JTShih, CUeng, SHHung, MSWu, SY Identification of Substituted Naphthotriazolediones as Novel Tryptophan 2,3-Dioxygenase (TDO) Inhibitors through Structure-Based Virtual Screening. J Med Chem58:7807-19 (2015) 
 
Receptor-type tyrosine-protein kinase FLT3
Name:Receptor-type tyrosine-protein kinase FLT3
Type:Enzyme
Mol. Mass.:112888.62
Organism:Homo sapiens (Human)
Description:P36888
Residue:993
BDBM50127174
NameBDBM50127174
Synonyms:CHEMBL3628599
TypeSmall organic molecule
Emp. Form.C23H21N5O3
Mol. Mass.415.4445
SMILESCN1CCN(CC1)C(=O)c1cccc(Cn2nnc3c2C(=O)c2ccccc2C3=O)c1