Reaction Details
TargetAcetyl-CoA carboxylase 1
LigandBDBM50127711
Substrate/Competitorn/a
Meas. Tech.ChEMBL_1522981 (CHEMBL3631157)
IC50 16±n/a nM
Citation Kung, DWGriffith, DAEsler, WPVajdos, FFMathiowetz, AMDoran, SDAmor, PABagley, SWBanks, TCabral, SFord, KGarcia-Irizarry, CNLandis, MSLoomis, KMcPherson, KNiosi, MRockwell, KLRose, CSmith, ACSouthers, JATapley, STu, MValentine, JJ Discovery of spirocyclic-diamine inhibitors of mammalian acetyl CoA-carboxylase. Bioorg Med Chem Lett25:5352-6 (2015) 
 
Acetyl-CoA carboxylase 1
Name:Acetyl-CoA carboxylase 1
Type:Protein
Mol. Mass.:265183.92
Organism:Rattus norvegicus (Rat)
Description:P11497
Residue:2345
BDBM50127711
NameBDBM50127711
Synonyms:CHEMBL3629719
TypeSmall organic molecule
Emp. Form.C24H34N4O3
Mol. Mass.426.5518
SMILESC[C@@H]1N(CCC11CCN(CC1)C(=O)c1cc(C)c2[nH]ncc2c1)C(=O)OCC(C)(C)C