Reaction Details
TargetAcetyl-CoA carboxylase 1
LigandBDBM50127718
Substrate/Competitorn/a
Meas. Tech.ChEMBL_1522981 (CHEMBL3631157)
IC50 65±n/a nM
Citation Kung, DWGriffith, DAEsler, WPVajdos, FFMathiowetz, AMDoran, SDAmor, PABagley, SWBanks, TCabral, SFord, KGarcia-Irizarry, CNLandis, MSLoomis, KMcPherson, KNiosi, MRockwell, KLRose, CSmith, ACSouthers, JATapley, STu, MValentine, JJ Discovery of spirocyclic-diamine inhibitors of mammalian acetyl CoA-carboxylase. Bioorg Med Chem Lett25:5352-6 (2015) 
 
Acetyl-CoA carboxylase 1
Name:Acetyl-CoA carboxylase 1
Type:Protein
Mol. Mass.:265183.92
Organism:Rattus norvegicus (Rat)
Description:P11497
Residue:2345
BDBM50127718
NameBDBM50127718
Synonyms:CHEMBL3629713
TypeSmall organic molecule
Emp. Form.C26H30N4O3
Mol. Mass.446.5414
SMILESC[C@@H](OC(=O)N1CCC2(C1)CCN(CC2)C(=O)c1cc(C)c2[nH]ncc2c1)c1ccccc1