Reaction Details
TargetPotassium voltage-gated channel subfamily H member 2
LigandBDBM50129562
Substrate/Competitorn/a
Meas. Tech.ChEMBL_1523572 (CHEMBL3631371)
IC50 1400±n/a nM
Citation Le Manach, CPaquet, TBrunschwig, CNjoroge, MHan, ZGonzàlez Cabrera, DBashyam, SDhinakaran, RTaylor, DReader, JBotha, MChurchyard, ALauterbach, SCoetzer, TLBirkholtz, LMMeister, SWinzeler, EAWaterson, DWitty, MJWittlin, SJiménez-Díaz, MBSantos Martínez, MFerrer, SAngulo-Barturen, IStreet, LJChibale, K A Novel Pyrazolopyridine with in Vivo Activity in Plasmodium berghei- and Plasmodium falciparum-Infected Mouse Models from Structure-Activity Relationship Studies around the Core of Recently Identified Antimalarial Imidazopyridazines. J Med Chem58:8713-22 (2015) 
 
Potassium voltage-gated channel subfamily H member 2
Name:Potassium voltage-gated channel subfamily H member 2
Type:Multi-pass membrane protein
Mol. Mass.:126672.65
Organism:Homo sapiens (Human)
Description:Q12809
Residue:1159
BDBM50129562
NameBDBM50129562
Synonyms:CHEMBL3628220
TypeSmall organic molecule
Emp. Form.C23H20N2O4S2
Mol. Mass.452.546
SMILESCS(=O)(=O)c1ccc(cc1)-c1cnn2ccc(cc12)-c1cccc(c1)S(=O)(=O)C1CC1