Reaction Details
TargetSuppressor of tumorigenicity 14 protein
LigandBDBM50130866
Substrate/Competitorn/a
Meas. Tech.ChEMBL_1525566 (CHEMBL3637192)
Ki 4400±n/a nM
Citation Goswami, RWohlfahrt, GTörmäkangas, OMoilanen, ALakshminarasimhan, ANagaraj, JArumugam, KNMukherjee, SChacko, ARKrishnamurthy, NRJaleel, MPalakurthy, RKSamiulla, DSRamachandra, M Structure-guided discovery of 2-aryl/pyridin-2-yl-1H-indole derivatives as potent and selective hepsin inhibitors. Bioorg Med Chem Lett25:5309-14 (2015) 
 
Suppressor of tumorigenicity 14 protein
Name:Suppressor of tumorigenicity 14 protein
Type:Single-pass type II membrane protein
Mol. Mass.:94769.23
Organism:Homo sapiens (Human)
Description:Q9Y5Y6
Residue:855
BDBM50130866
NameBDBM50130866
Synonyms:CHEMBL3632755
TypeSmall organic molecule
Emp. Form.C18H19N3O
Mol. Mass.293.363
SMILESCC(C)c1cccc(-c2cc3cc(ccc3[nH]2)C(N)=N)c1O