Reaction Details
TargetHistamine H3 receptor
LigandBDBM50134530
Substrate/Competitorn/a
Meas. Tech.ChEMBL_1545048 (CHEMBL3750002)
Ki 467±n/a nM
Citation Kuder, KLazewska, DLatacz, GSchwed, JSKarcz, TStark, HKarolak-Wojciechowska, JKiec-Kononowicz, K Chlorophenoxy aminoalkyl derivatives as histamine H(3)R ligands and antiseizure agents. Bioorg Med Chem24:53-72 (2016) 
 
Histamine H3 receptor
Name:Histamine H3 receptor
Type:G Protein-Coupled Receptor (GPCR)
Mol. Mass.:48691.47
Organism:Homo sapiens (Human)
Description:Binding assays were using CHO cells stably expressing hH3R receptors.
Residue:445
BDBM50134530
NameBDBM50134530
Synonyms:CHEMBL3747210
TypeSmall organic molecule
Emp. Form.C21H32ClNO5
Mol. Mass.413.935
SMILESOC(=O)C(O)=O.CC1CCN(CCCCCCCOc2ccc(Cl)cc2)CC1