Reaction Details
TargetHistamine H3 receptor
LigandBDBM50134545
Substrate/Competitorn/a
Meas. Tech.ChEMBL_1545048 (CHEMBL3750002)
Ki 800±n/a nM
Citation Kuder, KLazewska, DLatacz, GSchwed, JSKarcz, TStark, HKarolak-Wojciechowska, JKiec-Kononowicz, K Chlorophenoxy aminoalkyl derivatives as histamine H(3)R ligands and antiseizure agents. Bioorg Med Chem24:53-72 (2016) 
 
Histamine H3 receptor
Name:Histamine H3 receptor
Type:G Protein-Coupled Receptor (GPCR)
Mol. Mass.:48691.47
Organism:Homo sapiens (Human)
Description:Binding assays were using CHO cells stably expressing hH3R receptors.
Residue:445
BDBM50134545
NameBDBM50134545
Synonyms:CHEMBL3747286
TypeSmall organic molecule
Emp. Form.C19H28ClNO5
Mol. Mass.385.882
SMILESOC(=O)C(O)=O.CC1CCN(CCCCCOc2ccc(Cl)cc2)CC1