Reaction Details
TargetTyrosine-protein phosphatase non-receptor type 1
LigandBDBM50442397
Substrate/Competitorn/a
Meas. Tech.ChEMBL_1548348 (CHEMBL3755950)
Ki 29900±n/a nM
Citation Wang, YYuk, HJKim, JYKim, DWSong, YHTan, XFCurtis-Long, MJPark, KH Novel chromenedione derivatives displaying inhibition of protein tyrosine phosphatase 1B (PTP1B) from Flemingia philippinensis. Bioorg Med Chem Lett26:318-21 (2016) 
 
Tyrosine-protein phosphatase non-receptor type 1
Name:Tyrosine-protein phosphatase non-receptor type 1
Type:Protein phosphatase
Mol. Mass.:49963.76
Organism:Homo sapiens (Human)
Description:Human recombinant GST-fusion PTP1B (1-435).
Residue:435
BDBM50442397
NameBDBM50442397
Synonyms:OSAJIN
TypeSmall organic molecule
Emp. Form.C25H24O5
Mol. Mass.404.4551
SMILES[#6]\[#6](-[#6])=[#6]\[#6]-c1c(-[#8])c2c(occ(-c3ccc(-[#8])cc3)c2=O)c2-[#6]=[#6]C([#6])([#6])[#8]-c12