Reaction Details
TargetAcetylcholinesterase
LigandBDBM50139053
Substrate/Competitorn/a
Meas. Tech.ChEMBL_1549987 (CHEMBL3755285)
IC50 5650±n/a nM
Citation Lemes, LFde Andrade Ramos, Gde Oliveira, ASda Silva, FMde Castro Couto, Gda Silva Boni, MGuimarães, MJSouza, INBartolini, MAndrisano, Vdo Nascimento Nogueira, PCSilveira, ERBrand, GDSoukup, OKorábecný, JRomeiro, NCCastro, NGBolognesi, MLRomeiro, LA Cardanol-derived AChE inhibitors: Towards the development of dual binding derivatives for Alzheimer's disease. Eur J Med Chem108:687-700 (2016) 
 
Acetylcholinesterase
Name:Acetylcholinesterase
Type:Enzyme
Mol. Mass.:67792.70
Organism:Homo sapiens (Human)
Description:P22303
Residue:614
BDBM50139053
NameBDBM50139053
Synonyms:CHEMBL3752227
TypeSmall organic molecule
Emp. Form.C25H37NO2
Mol. Mass.383.5668
SMILESCCN(CCCCCCCCc1cccc(OC)c1)Cc1ccccc1OC