Reaction Details
TargetAcetylcholinesterase
LigandBDBM50139052
Substrate/Competitorn/a
Meas. Tech.ChEMBL_1549993 (CHEMBL3755444)
Ki 17000±n/a nM
Citation Lemes, LFde Andrade Ramos, Gde Oliveira, ASda Silva, FMde Castro Couto, Gda Silva Boni, MGuimarães, MJSouza, INBartolini, MAndrisano, Vdo Nascimento Nogueira, PCSilveira, ERBrand, GDSoukup, OKorábecný, JRomeiro, NCCastro, NGBolognesi, MLRomeiro, LA Cardanol-derived AChE inhibitors: Towards the development of dual binding derivatives for Alzheimer's disease. Eur J Med Chem108:687-700 (2016) 
 
Acetylcholinesterase
Name:Acetylcholinesterase
Type:Enzyme
Mol. Mass.:71812.79
Organism:Electrophorus electricus (Electric eel)
Description:n/a
Residue:633
BDBM50139052
NameBDBM50139052
Synonyms:CHEMBL3754700
TypeSmall organic molecule
Emp. Form.C23H33NO2
Mol. Mass.355.5136
SMILESCOc1cccc(CCCCCCCCNCc2ccccc2OC)c1