Reaction Details
TargetAcetylcholinesterase
LigandBDBM50139051
Substrate/Competitorn/a
Meas. Tech.ChEMBL_1549983 (CHEMBL3755281)
IC50 14300±n/a nM
Citation Lemes, LFde Andrade Ramos, Gde Oliveira, ASda Silva, FMde Castro Couto, Gda Silva Boni, MGuimarães, MJSouza, INBartolini, MAndrisano, Vdo Nascimento Nogueira, PCSilveira, ERBrand, GDSoukup, OKorábecný, JRomeiro, NCCastro, NGBolognesi, MLRomeiro, LA Cardanol-derived AChE inhibitors: Towards the development of dual binding derivatives for Alzheimer's disease. Eur J Med Chem108:687-700 (2016) 
 
Acetylcholinesterase
Name:Acetylcholinesterase
Type:Enzyme
Mol. Mass.:71812.79
Organism:Electrophorus electricus (Electric eel)
Description:n/a
Residue:633
BDBM50139051
NameBDBM50139051
Synonyms:CHEMBL3753070
TypeSmall organic molecule
Emp. Form.C23H38N2O3
Mol. Mass.390.5594
SMILESCOc1cccc(CCCCCCCCN2CCCC(C2)OC(=O)N(C)C)c1