Reaction Details
TargetAmine oxidase [flavin-containing] B
LigandBDBM50142080
Substrate/Competitorn/a
Meas. Tech.ChEMBL_1552408 (CHEMBL3760808)
Ki 10600±n/a nM
Citation Wu, FZhou, CYao, YWei, LFeng, ZDeng, LSong, Y 3-(Piperidin-4-ylmethoxy)pyridine Containing Compounds Are Potent Inhibitors of Lysine Specific Demethylase 1. J Med Chem59:253-63 (2016) 
 
Amine oxidase [flavin-containing] B
Name:Amine oxidase [flavin-containing] B
Type:Protein
Mol. Mass.:58768.76
Organism:Homo sapiens (Human)
Description:P27338
Residue:520
BDBM50142080
NameBDBM50142080
Synonyms:CHEMBL3758211
TypeSmall organic molecule
Emp. Form.C24H23N3O
Mol. Mass.369.4589
SMILESN#Cc1ccc(cc1)-c1cc(OCC2CCNCC2)cnc1-c1ccccc1