Reaction Details
TargetLysine-specific histone demethylase 1A
LigandBDBM50142073
Substrate/Competitorn/a
Meas. Tech.ChEMBL_1552405 (CHEMBL3760805)
Ki>50000±n/a nM
Citation Wu, FZhou, CYao, YWei, LFeng, ZDeng, LSong, Y 3-(Piperidin-4-ylmethoxy)pyridine Containing Compounds Are Potent Inhibitors of Lysine Specific Demethylase 1. J Med Chem59:253-63 (2016) 
 
Lysine-specific histone demethylase 1A
Name:Lysine-specific histone demethylase 1A
Type:Enzyme
Mol. Mass.:92901.01
Organism:Homo sapiens (Human)
Description:O60341
Residue:852
BDBM50142073
NameBDBM50142073
Synonyms:CHEMBL3760089
TypeSmall organic molecule
Emp. Form.C19H14N2O
Mol. Mass.286.3273
SMILESCc1ccc(cc1)-c1ncc(O)cc1-c1ccc(cc1)C#N