Reaction Details
TargetLysine-specific histone demethylase 1A
LigandBDBM50142245
Substrate/Competitorn/a
Meas. Tech.ChEMBL_1552405 (CHEMBL3760805)
Ki 16500±n/a nM
Citation Wu, FZhou, CYao, YWei, LFeng, ZDeng, LSong, Y 3-(Piperidin-4-ylmethoxy)pyridine Containing Compounds Are Potent Inhibitors of Lysine Specific Demethylase 1. J Med Chem59:253-63 (2016) 
 
Lysine-specific histone demethylase 1A
Name:Lysine-specific histone demethylase 1A
Type:Enzyme
Mol. Mass.:92901.01
Organism:Homo sapiens (Human)
Description:O60341
Residue:852
BDBM50142245
NameBDBM50142245
Synonyms:CHEMBL3758933
TypeSmall organic molecule
Emp. Form.C23H21BrN4O
Mol. Mass.449.343
SMILESBrc1ccc(cc1)-c1nc(OCC2CCNCC2)cnc1-c1ccc(cc1)C#N