Reaction Details
TargetAdenosine receptor A2a
LigandBDBM50139752
Substrate/Competitorn/a
Meas. Tech.ChEBML_1553861
Ki 3.0±n/a nM
Citation Zhou, GAslanian, RGallo, GKhan, TKuang, RPurakkattle, BDe Ruiz, MStamford, ATing, PWu, HWang, HXiao, DYu, TZhang, YMullins, DHodgson, R Discovery of aminoquinazoline derivatives as human A(2A) adenosine receptor antagonists. Bioorg Med Chem Lett26:1348-54 (2016) 
 
Adenosine receptor A2a
Name:Adenosine receptor A2a
Type:G Protein-Coupled Receptor (GPCR)
Mol. Mass.:44716.46
Organism:Homo sapiens (Human)
Description:P29274
Residue:412
BDBM50139752
NameBDBM50139752
Synonyms:CHEMBL3764434 | US10138212, Example 91
TypeSmall organic molecule
Emp. Form.C19H14ClN5O
Mol. Mass.363.8
SMILESNc1nc(C(=O)NCc2cccc3cccnc23)c2cccc(Cl)c2n1