Reaction Details
TargetAdenosine receptor A2a
LigandBDBM50139771
Substrate/Competitorn/a
Meas. Tech.ChEBML_1553861
Ki 0.200000±n/a nM
Citation Zhou, GAslanian, RGallo, GKhan, TKuang, RPurakkattle, BDe Ruiz, MStamford, ATing, PWu, HWang, HXiao, DYu, TZhang, YMullins, DHodgson, R Discovery of aminoquinazoline derivatives as human A(2A) adenosine receptor antagonists. Bioorg Med Chem Lett26:1348-54 (2016) 
 
Adenosine receptor A2a
Name:Adenosine receptor A2a
Type:G Protein-Coupled Receptor (GPCR)
Mol. Mass.:44716.46
Organism:Homo sapiens (Human)
Description:P29274
Residue:412
BDBM50139771
NameBDBM50139771
Synonyms:CHEMBL3765580 | US10138212, Example 12
TypeSmall organic molecule
Emp. Form.C20H17N5O2
Mol. Mass.359.3813
SMILESCOc1cccc2c(nc(N)nc12)C(=O)NCc1cccc2cccnc12