Reaction Details
TargetAdenosine receptor A2a
LigandBDBM50139777
Substrate/Competitorn/a
Meas. Tech.ChEBML_1553861
Ki 3.6±n/a nM
Citation Zhou, GAslanian, RGallo, GKhan, TKuang, RPurakkattle, BDe Ruiz, MStamford, ATing, PWu, HWang, HXiao, DYu, TZhang, YMullins, DHodgson, R Discovery of aminoquinazoline derivatives as human A(2A) adenosine receptor antagonists. Bioorg Med Chem Lett26:1348-54 (2016) 
 
Adenosine receptor A2a
Name:Adenosine receptor A2a
Type:G Protein-Coupled Receptor (GPCR)
Mol. Mass.:44716.46
Organism:Homo sapiens (Human)
Description:P29274
Residue:412
BDBM50139777
NameBDBM50139777
Synonyms:CHEMBL3764260
TypeSmall organic molecule
Emp. Form.C19H13F2N5O
Mol. Mass.365.3362
SMILESNc1nc(C(=O)NCc2cccc3cccnc23)c2cc(F)c(F)cc2n1