Reaction Details
TargetAdenosine receptor A2a
LigandBDBM50139817
Substrate/Competitorn/a
Meas. Tech.ChEBML_1553861
Ki 1.8±n/a nM
Citation Zhou, GAslanian, RGallo, GKhan, TKuang, RPurakkattle, BDe Ruiz, MStamford, ATing, PWu, HWang, HXiao, DYu, TZhang, YMullins, DHodgson, R Discovery of aminoquinazoline derivatives as human A(2A) adenosine receptor antagonists. Bioorg Med Chem Lett26:1348-54 (2016) 
 
Adenosine receptor A2a
Name:Adenosine receptor A2a
Type:G Protein-Coupled Receptor (GPCR)
Mol. Mass.:44716.46
Organism:Homo sapiens (Human)
Description:P29274
Residue:412
BDBM50139817
NameBDBM50139817
Synonyms:CHEMBL3765164
TypeSmall organic molecule
Emp. Form.C18H14FN5O2
Mol. Mass.351.3345
SMILESNc1nc(C(=O)NCc2cccc3CNC(=O)c23)c2cccc(F)c2n1