Reaction Details
TargetAdenosine receptor A2a
LigandBDBM50139835
Substrate/Competitorn/a
Meas. Tech.ChEBML_1553861
Ki 6.9±n/a nM
Citation Zhou, GAslanian, RGallo, GKhan, TKuang, RPurakkattle, BDe Ruiz, MStamford, ATing, PWu, HWang, HXiao, DYu, TZhang, YMullins, DHodgson, R Discovery of aminoquinazoline derivatives as human A(2A) adenosine receptor antagonists. Bioorg Med Chem Lett26:1348-54 (2016) 
 
Adenosine receptor A2a
Name:Adenosine receptor A2a
Type:G Protein-Coupled Receptor (GPCR)
Mol. Mass.:44716.46
Organism:Homo sapiens (Human)
Description:P29274
Residue:412
BDBM50139835
NameBDBM50139835
Synonyms:CHEMBL3765424
TypeSmall organic molecule
Emp. Form.C31H29FN6O2
Mol. Mass.536.5994
SMILESNc1nc(C(=O)NCc2cccc3cc(cnc23)C(=O)NCCCCCc2ccccc2)c2cccc(F)c2n1