Reaction Details
TargetAdenosine receptor A1
LigandBDBM50139765
Substrate/Competitorn/a
Meas. Tech.ChEBML_1553862
Ki 10.0±n/a nM
Citation Zhou, GAslanian, RGallo, GKhan, TKuang, RPurakkattle, BDe Ruiz, MStamford, ATing, PWu, HWang, HXiao, DYu, TZhang, YMullins, DHodgson, R Discovery of aminoquinazoline derivatives as human A(2A) adenosine receptor antagonists. Bioorg Med Chem Lett26:1348-54 (2016) 
 
Adenosine receptor A1
Name:Adenosine receptor A1
Type:G Protein-Coupled Receptor (GPCR)
Mol. Mass.:36520.92
Organism:Homo sapiens (Human)
Description:P30542
Residue:326
BDBM50139765
NameBDBM50139765
Synonyms:CHEMBL3763830 | US10138212, Example 96
TypeSmall organic molecule
Emp. Form.C19H14BrN5O
Mol. Mass.408.251
SMILESNc1nc(C(=O)NCc2cccc3cccnc23)c2cccc(Br)c2n1