Reaction Details
TargetAdenosine receptor A1
LigandBDBM50139837
Substrate/Competitorn/a
Meas. Tech.ChEBML_1553862
Ki 120±n/a nM
Citation Zhou, GAslanian, RGallo, GKhan, TKuang, RPurakkattle, BDe Ruiz, MStamford, ATing, PWu, HWang, HXiao, DYu, TZhang, YMullins, DHodgson, R Discovery of aminoquinazoline derivatives as human A(2A) adenosine receptor antagonists. Bioorg Med Chem Lett26:1348-54 (2016) 
 
Adenosine receptor A1
Name:Adenosine receptor A1
Type:G Protein-Coupled Receptor (GPCR)
Mol. Mass.:36520.92
Organism:Homo sapiens (Human)
Description:P30542
Residue:326
BDBM50139837
NameBDBM50139837
Synonyms:CHEMBL3764598
TypeSmall organic molecule
Emp. Form.C33H32FN7O4
Mol. Mass.609.6501
SMILESCOCCOc1ccc(cc1)N1CCN(CC1)C(=O)c1cnc2c(CNC(=O)c3nc(N)nc4c(F)cccc34)cccc2c1