Reaction Details
TargetAdenosine receptor A2a
LigandBDBM50139653
Substrate/Competitorn/a
Meas. Tech.ChEBML_1553863
Ki 11±n/a nM
Citation Zhou, GAslanian, RGallo, GKhan, TKuang, RPurakkattle, BDe Ruiz, MStamford, ATing, PWu, HWang, HXiao, DYu, TZhang, YMullins, DHodgson, R Discovery of aminoquinazoline derivatives as human A(2A) adenosine receptor antagonists. Bioorg Med Chem Lett26:1348-54 (2016) 
 
Adenosine receptor A2a
Name:Adenosine receptor A2a
Type:G Protein-Coupled Receptor (GPCR)
Mol. Mass.:45015.65
Organism:Rattus norvegicus (rat)
Description:Rat A2A receptors expressed in CHO cells.
Residue:410
BDBM50139653
NameBDBM50139653
Synonyms:CHEMBL3765818
TypeSmall organic molecule
Emp. Form.C19H15N5O
Mol. Mass.329.3553
SMILESNc1nc(C(=O)NCc2cccc3cccnc23)c2ccccc2n1