Reaction Details
TargetProstaglandin E2 receptor EP4 subtype
LigandBDBM50107283
Substrate/Competitorn/a
Meas. Tech.ChEMBL_1548142 (CHEMBL3754944)
IC50 1600±n/a nM
Citation Blanco, MJVetman, TChandrasekhar, SFisher, MJHarvey, AChambers, MLin, CMudra, DOskins, JWang, XSYu, XPWarshawsky, AM Discovery of potent aryl-substituted 3-[(3-methylpyridine-2-carbonyl) amino]-2,4-dimethyl-benzoic acid EP4 antagonists with improved pharmacokinetic profile. Bioorg Med Chem Lett26:931-5 (2016) 
 
Prostaglandin E2 receptor EP4 subtype
Name:Prostaglandin E2 receptor EP4 subtype
Type:Enzyme
Mol. Mass.:53134.53
Organism:Homo sapiens (Human)
Description:P35408
Residue:488
BDBM50107283
NameBDBM50107283
Synonyms:AAT-007 Grapiprant RQ-00000007 | RQ-7
TypeSmall organic molecule
Emp. Form.C26H29N5O3S
Mol. Mass.491.605
SMILESCCc1nc2c(C)nc(C)cc2n1-c1ccc(CCNC(=O)NS(=O)(=O)c2ccc(C)cc2)cc1