Reaction Details
TargetLysine-specific demethylase 6B
LigandBDBM50140576
Substrate/Competitorn/a
Meas. Tech.ChEMBL_1548620 (CHEMBL3757620)
IC50 550±n/a nM
Citation Hu, JWang, XChen, LHuang, MTang, WZuo, JLiu, YCShi, ZLiu, RShen, JXiong, B Design and discovery of new pyrimidine coupled nitrogen aromatic rings as chelating groups of JMJD3 inhibitors. Bioorg Med Chem Lett26:721-5 (2016) 
 
Lysine-specific demethylase 6B
Name:Lysine-specific demethylase 6B
Type:Protein
Mol. Mass.:176672.55
Organism:Homo sapiens (Human)
Description:O15054
Residue:1643
BDBM50140576
NameBDBM50140576
Synonyms:CHEMBL3752835
TypeSmall organic molecule
Emp. Form.C20H22FN7O2
Mol. Mass.411.4328
SMILESOC(=O)CCNc1nc(cc(n1)-n1cccn1)N1CCN(CC1)c1ccc(F)cc1