Reaction Details
TargetLysine-specific demethylase 6B
LigandBDBM50140682
Substrate/Competitorn/a
Meas. Tech.ChEMBL_1548620 (CHEMBL3757620)
IC50 1300±n/a nM
Citation Hu, JWang, XChen, LHuang, MTang, WZuo, JLiu, YCShi, ZLiu, RShen, JXiong, B Design and discovery of new pyrimidine coupled nitrogen aromatic rings as chelating groups of JMJD3 inhibitors. Bioorg Med Chem Lett26:721-5 (2016) 
 
Lysine-specific demethylase 6B
Name:Lysine-specific demethylase 6B
Type:Protein
Mol. Mass.:176672.55
Organism:Homo sapiens (Human)
Description:O15054
Residue:1643
BDBM50140682
NameBDBM50140682
Synonyms:CHEMBL3752967
TypeSmall organic molecule
Emp. Form.C18H21N9O2
Mol. Mass.395.4184
SMILESOC(=O)CCNc1nc(cc(n1)-n1nccn1)N1CCN(CC1)c1ccccn1