Reaction Details
TargetSimilar to alpha-tubulin isoform 1
LigandBDBM50005480
Substrate/Competitorn/a
Meas. Tech.ChEMBL_1553091 (CHEMBL3766609)
IC50 650±n/a nM
Citation Medellin, DCZhou, QScott, RHill, RMFrail, SKDasari, ROntiveros, SJPelly, SCvan Otterlo, WABetancourt, TShuster, CBHamel, EBai, RLaBarbera, DVRogelj, SFrolova, LVKornienko, A Novel Microtubule-Targeting 7-Deazahypoxanthines Derived from Marine Alkaloid Rigidins with Potent in Vitro and in Vivo Anticancer Activities. J Med Chem59:480-5 (2016) 
 
Similar to alpha-tubulin isoform 1
Name:Similar to alpha-tubulin isoform 1
Synonyms:Similar to alpha-tubulin isoform 1
Type:PROTEIN
Mol. Mass.:10383.05
Organism:Bos taurus
Description:ChEMBL_104716
Residue:99
BDBM50005480
NameBDBM50005480
TypeSmall organic molecule
Emp. Form.C18H20O5
Mol. Mass.316.3484
SMILESCOc1ccc(\C=C/c2cc(OC)c(OC)c(OC)c2)cc1O