Reaction Details
TargetIndoleamine 2,3-dioxygenase 1
LigandBDBM50145158
Substrate/Competitorn/a
Meas. Tech.ChEMBL_1553580 (CHEMBL3769112)
EC50 365±n/a nM
Citation Lin, SYYeh, TKKuo, CCSong, JSCheng, MFLiao, FYChao, MWHuang, HLChen, YLYang, CYWu, MHHsieh, CLHsiao, WPeng, YHWu, JSLin, LMSun, MChao, YSShih, CWu, SYPan, SLHung, MSUeng, SH Phenyl Benzenesulfonylhydrazides Exhibit Selective Indoleamine 2,3-Dioxygenase Inhibition with Potent in Vivo Pharmacodynamic Activity and Antitumor Efficacy. J Med Chem59:419-30 (2016) 
 
Indoleamine 2,3-dioxygenase 1
Name:Indoleamine 2,3-dioxygenase 1
Type:Enzyme
Mol. Mass.:45330.80
Organism:Homo sapiens (Human)
Description:P14902
Residue:403
BDBM50145158
NameBDBM50145158
Synonyms:CHEMBL3764144
TypeSmall organic molecule
Emp. Form.C15H14BrN3O3S
Mol. Mass.396.259
SMILESCN1C(=O)Cc2cc(ccc12)S(=O)(=O)NNc1ccc(Br)cc1