Reaction Details
TargetIndoleamine 2,3-dioxygenase 1
LigandBDBM50145163
Substrate/Competitorn/a
Meas. Tech.ChEMBL_1553783 (CHEMBL3766998)
IC50 112±n/a nM
Citation Lin, SYYeh, TKKuo, CCSong, JSCheng, MFLiao, FYChao, MWHuang, HLChen, YLYang, CYWu, MHHsieh, CLHsiao, WPeng, YHWu, JSLin, LMSun, MChao, YSShih, CWu, SYPan, SLHung, MSUeng, SH Phenyl Benzenesulfonylhydrazides Exhibit Selective Indoleamine 2,3-Dioxygenase Inhibition with Potent in Vivo Pharmacodynamic Activity and Antitumor Efficacy. J Med Chem59:419-30 (2016) 
 
Indoleamine 2,3-dioxygenase 1
Name:Indoleamine 2,3-dioxygenase 1
Type:Enzyme
Mol. Mass.:45330.80
Organism:Homo sapiens (Human)
Description:P14902
Residue:403
BDBM50145163
NameBDBM50145163
Synonyms:CHEMBL3763962
TypeSmall organic molecule
Emp. Form.C16H16BrN3O3S
Mol. Mass.410.286
SMILESBrc1ccc(NNS(=O)(=O)c2ccc3NC(=O)CCCc3c2)cc1