Reaction Details
TargetIndoleamine 2,3-dioxygenase 1
LigandBDBM50145164
Substrate/Competitorn/a
Meas. Tech.ChEMBL_1553580 (CHEMBL3769112)
EC50 63±n/a nM
Citation Lin, SYYeh, TKKuo, CCSong, JSCheng, MFLiao, FYChao, MWHuang, HLChen, YLYang, CYWu, MHHsieh, CLHsiao, WPeng, YHWu, JSLin, LMSun, MChao, YSShih, CWu, SYPan, SLHung, MSUeng, SH Phenyl Benzenesulfonylhydrazides Exhibit Selective Indoleamine 2,3-Dioxygenase Inhibition with Potent in Vivo Pharmacodynamic Activity and Antitumor Efficacy. J Med Chem59:419-30 (2016) 
 
Indoleamine 2,3-dioxygenase 1
Name:Indoleamine 2,3-dioxygenase 1
Type:Enzyme
Mol. Mass.:45330.80
Organism:Homo sapiens (Human)
Description:P14902
Residue:403
BDBM50145164
NameBDBM50145164
Synonyms:CHEMBL3765698
TypeSmall organic molecule
Emp. Form.C13H11BrN4O3S
Mol. Mass.383.22
SMILESOc1nc2cc(ccc2[nH]1)S(=O)(=O)NNc1ccc(Br)cc1