Reaction Details
TargetIndoleamine 2,3-dioxygenase 1
LigandBDBM50145165
Substrate/Competitorn/a
Meas. Tech.ChEMBL_1553783 (CHEMBL3766998)
IC50 122±n/a nM
Citation Lin, SYYeh, TKKuo, CCSong, JSCheng, MFLiao, FYChao, MWHuang, HLChen, YLYang, CYWu, MHHsieh, CLHsiao, WPeng, YHWu, JSLin, LMSun, MChao, YSShih, CWu, SYPan, SLHung, MSUeng, SH Phenyl Benzenesulfonylhydrazides Exhibit Selective Indoleamine 2,3-Dioxygenase Inhibition with Potent in Vivo Pharmacodynamic Activity and Antitumor Efficacy. J Med Chem59:419-30 (2016) 
 
Indoleamine 2,3-dioxygenase 1
Name:Indoleamine 2,3-dioxygenase 1
Type:Enzyme
Mol. Mass.:45330.80
Organism:Homo sapiens (Human)
Description:P14902
Residue:403
BDBM50145165
NameBDBM50145165
Synonyms:CHEMBL3765220
TypeSmall organic molecule
Emp. Form.C13H12BrN5O2S
Mol. Mass.382.236
SMILESNc1nc2cc(ccc2[nH]1)S(=O)(=O)NNc1ccc(Br)cc1