Reaction Details
TargetMacrophage-stimulating protein receptor
LigandBDBM50146164
Substrate/Competitorn/a
Meas. Tech.ChEMBL_1555013 (CHEMBL3767453)
IC50<3.0±n/a nM
Citation Zhang, JJiang, XJiang, YGuo, MZhang, SLi, JHe, JLiu, JWang, JOuyang, L Recent advances in the development of dual VEGFR and c-Met small molecule inhibitors as anticancer drugs. Eur J Med Chem108:495-504 (2016) 
 
Macrophage-stimulating protein receptor
Name:Macrophage-stimulating protein receptor
Type:Protein
Mol. Mass.:152270.76
Organism:Homo sapiens (Human)
Description:Q04912
Residue:1400
BDBM50146164
NameBDBM50146164
Synonyms:CHEMBL2143592
TypeSmall organic molecule
Emp. Form.C23H15ClF2N4O3
Mol. Mass.468.84
SMILESNc1nccc(Oc2ccc(NC(=O)c3c[nH]cc(-c4ccc(F)cc4)c3=O)cc2F)c1Cl